Discussion:
Testsuite fails in gltests/havelib
(too old to reply)
Tim Rühsen
2017-08-05 16:56:41 UTC
Permalink
Raw Message
Any idea what's wrong ?

$ make clean && make check
...
Testsuite summary for dummy 0
============================================================================
# TOTAL: 1150
# PASS: 1068
# SKIP: 82
# XFAIL: 0
# FAIL: 0
# XPASS: 0
# ERROR: 0
============================================================================
make[5]: Leaving directory '/home/tim/src/testdir1/gltests'
make[4]: Leaving directory '/home/tim/src/testdir1/gltests'
make[3]: Leaving directory '/home/tim/src/testdir1/gltests'
Making check in havelib
make[3]: Entering directory '/home/tim/src/testdir1/gltests/havelib'
make check-TESTS
make[4]: Entering directory '/home/tim/src/testdir1/gltests/havelib'
make[5]: Entering directory '/home/tim/src/testdir1/gltests/havelib'
/bin/bash: /bin/bash: cannot execute binary file
Makefile:2822: recipe for target 'rpath-1b.log' failed
make[5]: *** [rpath-1b.log] Error 126
make[5]: *** Waiting for unfinished jobs....
/bin/bash: /bin/bash: cannot execute binary file
/bin/bash: /bin/bash: cannot execute binary file
Makefile:2815: recipe for target 'rpath-1a.log' failed
make[5]: *** [rpath-1a.log] Error 126
Makefile:2836: recipe for target 'rpath-2aab.log' failed
make[5]: *** [rpath-2aab.log] Error 126
/bin/bash: /bin/bash: cannot execute binary file
/bin/bash: /bin/bash: cannot execute binary file
/bin/bash: /bin/bash: cannot execute binary file
/bin/bash: /bin/bash: cannot execute binary file
/bin/bash: /bin/bash: cannot execute binary file
Makefile:2857: recipe for target 'rpath-2abb.log' failed
/bin/bash: /bin/bash: cannot execute binary file
make[5]: *** [rpath-2abb.log] Error 126
Makefile:2864: recipe for target 'rpath-2abd.log' failed
make[5]: *** [rpath-2abd.log] Error 126
Makefile:2829: recipe for target 'rpath-2aaa.log' failed
make[5]: *** [rpath-2aaa.log] Error 126
Makefile:2885: recipe for target 'rpath-2bad.log' failed
make[5]: *** [rpath-2bad.log] Error 126
Makefile:2843: recipe for target 'rpath-2aad.log' failed
Bruno Haible
2017-08-05 18:04:49 UTC
Permalink
Raw Message
Post by Tim Rühsen
Any idea what's wrong ?
/bin/bash: /bin/bash: cannot execute binary file
Makefile:2822: recipe for target 'rpath-1b.log' failed
Since no one touched the 'havelib' module recently, you can ignore it.

Maybe something in your setup (LD_LIBRARY_PATH or such things)...

Bruno

Loading...